Reaction Details
TargetMu-type opioid receptor
LigandBDBM50001157
Substrate/Competitorn/a
Meas. Tech.ChEMBL_1552638 (CHEMBL3762577)
Ki 1.2±n/a nM
Citation Turnaturi, RAricò, GRonsisvalle, GParenti, CPasquinucci, L Multitarget opioid ligands in pain relief: New players in an old game. Eur J Med Chem108:211-28 (2016) 
 
Mu-type opioid receptor
Name:Mu-type opioid receptor
Type:G Protein-Coupled Receptor (GPCR)
Mol. Mass.:44789.51
Organism:Homo sapiens (Human)
Description:P35372
Residue:400
BDBM50001157
NameBDBM50001157
Synonyms:CHEMBL538700
TypeSmall organic molecule
Emp. Form.C39H43N5O5
Mol. Mass.661.7892
SMILESCc1cc(O)cc(C)c1C[C@H](N)C(=O)N1Cc2ccccc2C[C@H]1C(=O)N[C@@H](Cc1ccccc1)C(=O)N[C@@H](Cc1ccccc1)C(N)=O