Reaction Details
TargetMu-type opioid receptor
LigandBDBM50142692
Substrate/Competitorn/a
Meas. Tech.ChEMBL_1552638 (CHEMBL3762577)
Ki 0.830000±n/a nM
Citation Turnaturi, RAricò, GRonsisvalle, GParenti, CPasquinucci, L Multitarget opioid ligands in pain relief: New players in an old game. Eur J Med Chem108:211-28 (2016) 
 
Mu-type opioid receptor
Name:Mu-type opioid receptor
Type:G Protein-Coupled Receptor (GPCR)
Mol. Mass.:44789.51
Organism:Homo sapiens (Human)
Description:P35372
Residue:400
BDBM50142692
NameBDBM50142692
Synonyms:CHEMBL3759092
TypeSmall organic molecule
Emp. Form.C23H28N2O2
Mol. Mass.364.4806
SMILES[H][C@]12Cc3ccc(O)cc3[C@](C)(CCN1CCC(=O)Nc1ccccc1)[C@H]2C