Reaction Details
TargetMu-type opioid receptor
LigandBDBM50142702
Substrate/Competitorn/a
Meas. Tech.ChEMBL_1552639 (CHEMBL3762578)
IC50 67±n/a nM
Citation Turnaturi, RAricò, GRonsisvalle, GParenti, CPasquinucci, L Multitarget opioid ligands in pain relief: New players in an old game. Eur J Med Chem108:211-28 (2016) 
 
Mu-type opioid receptor
Name:Mu-type opioid receptor
Type:Enzyme Catalytic Domain
Mol. Mass.:11165.58
Organism:GUINEA PIG
Description:P97266
Residue:98
BDBM50142702
NameBDBM50142702
Synonyms:CHEMBL3758231
TypeSmall organic molecule
Emp. Form.C71H97N13O10
Mol. Mass.1292.611
SMILESCc1cc(O)cc(C)c1C[C@H](N)C(=O)N[C@H](CCCNC(N)=N)C(=O)N[C@@H](Cc1ccccc1)C(=O)N[C@@H](CCCCN)C(=O)NCCN(CC1Cc2ccccc2CN1C(=O)[C@@H](N)Cc1ccc(O)cc1)[C@@H](Cc1ccccc1)C(=O)NC(CC1CCCCC1)C(O)=O