Reaction Details
TargetDelta-type opioid receptor
LigandBDBM50142621
Substrate/Competitorn/a
Meas. Tech.ChEMBL_1552636 (CHEMBL3762575)
Ki 0.151356±n/a nM
Citation Turnaturi, RAricò, GRonsisvalle, GParenti, CPasquinucci, L Multitarget opioid ligands in pain relief: New players in an old game. Eur J Med Chem108:211-28 (2016) 
 
Delta-type opioid receptor
Name:Delta-type opioid receptor
Type:G Protein-Coupled Receptor (GPCR)
Mol. Mass.:40382.98
Organism:Homo sapiens (Human)
Description:Competition binding assays were carried out using membrane preparations from transfected HN9.10 cells that constitutively expressed the delta opioid receptor.
Residue:372
BDBM50142621
NameBDBM50142621
Synonyms:CHEMBL3759292
TypeSmall organic molecule
Emp. Form.C30H34N4O4
Mol. Mass.514.6154
SMILESCc1cc(O)cc(C)c1C[C@H](N)C(=O)N1Cc2ccccc2C[C@@H]1C(=O)NCC(=O)NCc1ccccc1