Reaction Details
TargetDelta-type opioid receptor
LigandBDBM50142691
Substrate/Competitorn/a
Meas. Tech.ChEMBL_1552797 (CHEMBL3760690)
Ki 208±n/a nM
Citation Turnaturi, RAricò, GRonsisvalle, GParenti, CPasquinucci, L Multitarget opioid ligands in pain relief: New players in an old game. Eur J Med Chem108:211-28 (2016) 
 
Delta-type opioid receptor
Name:Delta-type opioid receptor
Type:G Protein-Coupled Receptor (GPCR)
Mol. Mass.:40382.98
Organism:Homo sapiens (Human)
Description:Competition binding assays were carried out using membrane preparations from transfected HN9.10 cells that constitutively expressed the delta opioid receptor.
Residue:372
BDBM50142691
NameBDBM50142691
Synonyms:CHEMBL3758348
TypeSmall organic molecule
Emp. Form.C18H21NO5
Mol. Mass.331.363
SMILES[H][C@@]12Cc3ccc(O)c4O[C@@]5(CO)C(=O)CC[C@]1(O)[C@@]5(CCN2C)c34