Reaction Details
TargetDelta-type opioid receptor
LigandBDBM50142696
Substrate/Competitorn/a
Meas. Tech.ChEMBL_1552634 (CHEMBL3762573)
Ki 0.480000±n/a nM
Citation Turnaturi, RAricò, GRonsisvalle, GParenti, CPasquinucci, L Multitarget opioid ligands in pain relief: New players in an old game. Eur J Med Chem108:211-28 (2016) 
 
Delta-type opioid receptor
Name:Delta-type opioid receptor
Type:G Protein-Coupled Receptor (GPCR)
Mol. Mass.:40382.98
Organism:Homo sapiens (Human)
Description:Competition binding assays were carried out using membrane preparations from transfected HN9.10 cells that constitutively expressed the delta opioid receptor.
Residue:372
BDBM50142696
NameBDBM50142696
Synonyms:CHEMBL3758259
TypeSmall organic molecule
Emp. Form.C38H42N6O6S2
Mol. Mass.742.907
SMILESN[C@@H](Cc1ccc(O)cc1)C(=O)N[C@H]1CSCSC[C@@H](NC(=O)[C@H](Cc2ccc3ccccc3c2)NC(=O)[C@H](Cc2ccccc2)NC1=O)C(N)=O