Reaction Details
TargetTrypanothione reductase
LigandBDBM50142683
Substrate/Competitorn/a
Meas. Tech.ChEMBL_1552581 (CHEMBL3762226)
IC50 69200±n/a nM
Citation Marcu, ASchurigt, UMüller, KMoll, HKrauth-Siegel, RLPrinz, H Inhibitory effect of phenothiazine- and phenoxazine-derived chloroacetamides on Leishmania major growth and Trypanosoma brucei trypanothione reductase. Eur J Med Chem108:436-43 (2016) 
 
Trypanothione reductase
Name:Trypanothione reductase
Type:Homodimer; oxidoreductase
Mol. Mass.:53285.53
Organism:Trypanosoma brucei brucei
Description:n/a
Residue:492
BDBM50142683
NameBDBM50142683
Synonyms:CHEMBL1801896
TypeSmall organic molecule
Emp. Form.C12H8ClNO
Mol. Mass.217.651
SMILESClc1ccc2Oc3ccccc3Nc2c1