Reaction Details
TargetTyrosine-protein phosphatase non-receptor type 1
LigandBDBM50142961
Substrate/Competitorn/a
Meas. Tech.ChEMBL_1553046 (CHEMBL3760330)
IC50 9660±n/a nM
Citation Zhang, LJiang, CSGao, LXGong, JXWang, ZHLi, JYLi, JLi, XWGuo, YW Design, synthesis and in vitro activity of phidianidine B derivatives as novel PTP1B inhibitors with specific selectivity. Bioorg Med Chem Lett26:778-81 (2016) 
 
Tyrosine-protein phosphatase non-receptor type 1
Name:Tyrosine-protein phosphatase non-receptor type 1
Type:Protein phosphatase
Mol. Mass.:49963.76
Organism:Homo sapiens (Human)
Description:Human recombinant GST-fusion PTP1B (1-435).
Residue:435
BDBM50142961
NameBDBM50142961
Synonyms:CHEMBL3758715
TypeSmall organic molecule
Emp. Form.C26H24N4O
Mol. Mass.408.495
SMILESCCCCc1ccc(cc1)-c1cccc(n1)-c1noc(Cc2c[nH]c3ccccc23)n1