Reaction Details
TargetDelta-type opioid receptor
LigandBDBM50143183
Substrate/Competitorn/a
Meas. Tech.ChEMBL_1550876 (CHEMBL3762661)
EC50 54±n/a nM
Citation Perlikowska, RPiekielna, JGentilucci, LDe Marco, RCerlesi, MCCalo, GArtali, RTömböly, CKluczyk, AJanecka, A Synthesis of mixed MOR/KOR efficacy cyclic opioid peptide analogs with antinociceptive activity after systemic administration. Eur J Med Chem109:276-86 (2016) 
 
Delta-type opioid receptor
Name:Delta-type opioid receptor
Type:G Protein-Coupled Receptor (GPCR)
Mol. Mass.:40382.98
Organism:Homo sapiens (Human)
Description:Competition binding assays were carried out using membrane preparations from transfected HN9.10 cells that constitutively expressed the delta opioid receptor.
Residue:372
BDBM50143183
NameBDBM50143183
Synonyms:CHEMBL3759179
TypeSmall organic molecule
Emp. Form.C43H51N7O7
Mol. Mass.777.9077
SMILESCc1cc(O)cc(C)c1C[C@H](N)C(=O)N[C@@H]1CCCCNC(=O)C[C@H](NC(=O)[C@@H](Cc2ccc3ccccc3c2)NC(=O)[C@H](Cc2ccccc2)NC1=O)C(N)=O