Reaction Details
TargetKappa-type opioid receptor
LigandBDBM50143183
Substrate/Competitorn/a
Meas. Tech.ChEMBL_1550877 (CHEMBL3762662)
EC50 102±n/a nM
Citation Perlikowska, RPiekielna, JGentilucci, LDe Marco, RCerlesi, MCCalo, GArtali, RTömböly, CKluczyk, AJanecka, A Synthesis of mixed MOR/KOR efficacy cyclic opioid peptide analogs with antinociceptive activity after systemic administration. Eur J Med Chem109:276-86 (2016) 
 
Kappa-type opioid receptor
Name:Kappa-type opioid receptor
Type:G Protein-Coupled Receptor (GPCR)
Mol. Mass.:42648.76
Organism:Homo sapiens (Human)
Description:P41145
Residue:380
BDBM50143183
NameBDBM50143183
Synonyms:CHEMBL3759179
TypeSmall organic molecule
Emp. Form.C43H51N7O7
Mol. Mass.777.9077
SMILESCc1cc(O)cc(C)c1C[C@H](N)C(=O)N[C@@H]1CCCCNC(=O)C[C@H](NC(=O)[C@@H](Cc2ccc3ccccc3c2)NC(=O)[C@H](Cc2ccccc2)NC1=O)C(N)=O