Reaction Details
TargetDelta-type opioid receptor
LigandBDBM50359546
Substrate/Competitorn/a
Meas. Tech.ChEMBL_1550860 (CHEMBL3762645)
Ki 171±n/a nM
Citation Perlikowska, RPiekielna, JGentilucci, LDe Marco, RCerlesi, MCCalo, GArtali, RTömböly, CKluczyk, AJanecka, A Synthesis of mixed MOR/KOR efficacy cyclic opioid peptide analogs with antinociceptive activity after systemic administration. Eur J Med Chem109:276-86 (2016) 
 
Delta-type opioid receptor
Name:Delta-type opioid receptor
Type:G Protein-Coupled Receptor (GPCR)
Mol. Mass.:40465.04
Organism:Rattus norvegicus (rat)
Description:Competition binding assays were using CHO-K1 cell membranes expressing the opioid receptor.
Residue:372
BDBM50359546
NameBDBM50359546
Synonyms:CHEMBL1927270
TypeSmall organic molecule
Emp. Form.C37H45N7O7
Mol. Mass.699.7959
SMILESN[C@@H](Cc1ccc(O)cc1)C(=O)N[C@@H]1CCCCNC(=O)C[C@H](NC(=O)[C@H](Cc2ccccc2)NC(=O)[C@H](Cc2ccccc2)NC1=O)C(N)=O