Reaction Details
TargetSphingosine 1-phosphate receptor 2
LigandBDBM50143198
Substrate/Competitorn/a
Meas. Tech.ChEMBL_1550899 (CHEMBL3762854)
IC50 11±n/a nM
Citation Kusumi, KShinozaki, KYamaura, YHashimoto, AKurata, HNaganawa, AOtsuki, KMatsushita, TSekiguchi, TKakuuchi, AYamamoto, HSeko, T Discovery of novel S1P2 antagonists, part 3: Improving the oral bioavailability of a series of 1,3-bis(aryloxy)benzene derivatives. Bioorg Med Chem Lett26:1209-13 (2016) 
 
Sphingosine 1-phosphate receptor 2
Name:Sphingosine 1-phosphate receptor 2
Type:G Protein-Coupled Receptor (GPCR)
Mol. Mass.:38883.16
Organism:Homo sapiens (Human)
Description:Membranes isolated from S1P2-transfected CHO cells were used in ligand binding assay.
Residue:353
BDBM50143198
NameBDBM50143198
Synonyms:CHEMBL3758974
TypeSmall organic molecule
Emp. Form.C30H33FN2O7
Mol. Mass.552.5906
SMILESCOc1cc(Oc2cc(NC(=O)N3CCC(O)(CC(C)C)CC3)cc(Oc3ccc(F)cc3)c2)ccc1C(O)=O