Reaction Details
TargetSphingosine 1-phosphate receptor 2
LigandBDBM149712
Substrate/Competitorn/a
Meas. Tech.ChEMBL_1550899 (CHEMBL3762854)
IC50 2.3±n/a nM
Citation Kusumi, KShinozaki, KYamaura, YHashimoto, AKurata, HNaganawa, AOtsuki, KMatsushita, TSekiguchi, TKakuuchi, AYamamoto, HSeko, T Discovery of novel S1P2 antagonists, part 3: Improving the oral bioavailability of a series of 1,3-bis(aryloxy)benzene derivatives. Bioorg Med Chem Lett26:1209-13 (2016) 
 
Sphingosine 1-phosphate receptor 2
Name:Sphingosine 1-phosphate receptor 2
Type:G Protein-Coupled Receptor (GPCR)
Mol. Mass.:38883.16
Organism:Homo sapiens (Human)
Description:Membranes isolated from S1P2-transfected CHO cells were used in ligand binding assay.
Residue:353
BDBM149712
NameBDBM149712
Synonyms:US8975409, Example 9
TypeSmall organic molecule
Emp. Form.C32H37FN2O6
Mol. Mass.564.6444
SMILESCC(C)CC1(O)CCN(CC1)C(=O)Nc1cc(Oc2ccc(F)cc2)cc(Oc2ccc(cc2)C(C)(C)C(O)=O)c1