Reaction Details
TargetHistone deacetylase 2
LigandBDBM50143215
Substrate/Competitorn/a
Meas. Tech.ChEMBL_1553004 (CHEMBL3760288)
IC50 54±n/a nM
Citation Kachhadia, VRajagopal, SPonpandian, TVignesh, RAnandhan, KPrabhu, DRajendran, PNidhyanandan, SRoy, AMAhamed, FASurendran, NRajagopal, SNarayanan, SGopalan, B Orally available stilbene derivatives as potent HDAC inhibitors with antiproliferative activities and antitumor effects in human tumor xenografts. Eur J Med Chem108:274-86 (2016) 
 
Histone deacetylase 2
Name:Histone deacetylase 2
Type:Chromatin regulator; hydrolase; repressor
Mol. Mass.:55356.54
Organism:Homo sapiens (Human)
Description:Q92769
Residue:488
BDBM50143215
NameBDBM50143215
Synonyms:CHEMBL3758457
TypeSmall organic molecule
Emp. Form.C21H21FN2O2
Mol. Mass.352.402
SMILESONC(=O)\C=C\c1ccc(\C=C(\CNC2CC2)c2ccc(F)cc2)cc1