Reaction Details
TargetHistone deacetylase 7
LigandBDBM50143215
Substrate/Competitorn/a
Meas. Tech.ChEMBL_1553009 (CHEMBL3760293)
IC50 1500±n/a nM
Citation Kachhadia, VRajagopal, SPonpandian, TVignesh, RAnandhan, KPrabhu, DRajendran, PNidhyanandan, SRoy, AMAhamed, FASurendran, NRajagopal, SNarayanan, SGopalan, B Orally available stilbene derivatives as potent HDAC inhibitors with antiproliferative activities and antitumor effects in human tumor xenografts. Eur J Med Chem108:274-86 (2016) 
 
Histone deacetylase 7
Name:Histone deacetylase 7
Type:Chromatin regulator; hydrolase; repressor
Mol. Mass.:102942.62
Organism:Homo sapiens (Human)
Description:Q8WUI4
Residue:952
BDBM50143215
NameBDBM50143215
Synonyms:CHEMBL3758457
TypeSmall organic molecule
Emp. Form.C21H21FN2O2
Mol. Mass.352.402
SMILESONC(=O)\C=C\c1ccc(\C=C(\CNC2CC2)c2ccc(F)cc2)cc1