Reaction Details
TargetTyrosine-protein kinase receptor TYRO3
LigandBDBM50143216
Substrate/Competitorn/a
Meas. Tech.ChEMBL_1550515 (CHEMBL3762053)
IC50>1000±n/a nM
Citation Liu, YJin, SPeng, XLu, DZeng, LSun, YAi, JGeng, MHu, Y Pyridazinone derivatives displaying highly potent and selective inhibitory activities against c-Met tyrosine kinase. Eur J Med Chem108:322-33 (2016) 
 
Tyrosine-protein kinase receptor TYRO3
Name:Tyrosine-protein kinase receptor TYRO3
Type:Protein
Mol. Mass.:96894.13
Organism:Homo sapiens (Human)
Description:Q06418
Residue:890
BDBM50143216
NameBDBM50143216
Synonyms:CHEMBL3759079
TypeSmall organic molecule
Emp. Form.C23H21N9O
Mol. Mass.439.4725
SMILESCn1cc(cn1)-c1cnc(Nc2cccc(Cn3nc(ccc3=O)-c3cnn(C)c3)c2)nc1