Reaction Details
TargetPlatelet-derived growth factor receptor alpha
LigandBDBM50143216
Substrate/Competitorn/a
Meas. Tech.ChEMBL_1550519 (CHEMBL3762057)
IC50>1000±n/a nM
Citation Liu, YJin, SPeng, XLu, DZeng, LSun, YAi, JGeng, MHu, Y Pyridazinone derivatives displaying highly potent and selective inhibitory activities against c-Met tyrosine kinase. Eur J Med Chem108:322-33 (2016) 
 
Platelet-derived growth factor receptor alpha
Name:Platelet-derived growth factor receptor alpha
Type:Protein
Mol. Mass.:122633.38
Organism:Homo sapiens (Human)
Description:P16234
Residue:1089
BDBM50143216
NameBDBM50143216
Synonyms:CHEMBL3759079
TypeSmall organic molecule
Emp. Form.C23H21N9O
Mol. Mass.439.4725
SMILESCn1cc(cn1)-c1cnc(Nc2cccc(Cn3nc(ccc3=O)-c3cnn(C)c3)c2)nc1