Reaction Details
TargetHepatocyte growth factor receptor
LigandBDBM50143247
Substrate/Competitorn/a
Meas. Tech.ChEMBL_1550500 (CHEMBL3762038)
IC50>100±n/a nM
Citation Liu, YJin, SPeng, XLu, DZeng, LSun, YAi, JGeng, MHu, Y Pyridazinone derivatives displaying highly potent and selective inhibitory activities against c-Met tyrosine kinase. Eur J Med Chem108:322-33 (2016) 
 
Hepatocyte growth factor receptor
Name:Hepatocyte growth factor receptor
Type:Protein
Mol. Mass.:155559.73
Organism:Homo sapiens (Human)
Description:P08581
Residue:1390
BDBM50143247
NameBDBM50143247
Synonyms:CHEMBL3758539
TypeSmall organic molecule
Emp. Form.C25H29N9O
Mol. Mass.471.5575
SMILESCN1CCN(Cc2cnc(Nc3cccc(Cn4nc(ccc4=O)-c4cnn(C)c4)c3)nc2)CC1