Reaction Details
TargetHepatocyte growth factor receptor
LigandBDBM50143252
Substrate/Competitorn/a
Meas. Tech.ChEMBL_1550500 (CHEMBL3762038)
IC50 19±n/a nM
Citation Liu, YJin, SPeng, XLu, DZeng, LSun, YAi, JGeng, MHu, Y Pyridazinone derivatives displaying highly potent and selective inhibitory activities against c-Met tyrosine kinase. Eur J Med Chem108:322-33 (2016) 
 
Hepatocyte growth factor receptor
Name:Hepatocyte growth factor receptor
Type:Protein
Mol. Mass.:155559.73
Organism:Homo sapiens (Human)
Description:P08581
Residue:1390
BDBM50143252
NameBDBM50143252
Synonyms:CHEMBL3758905
TypeSmall organic molecule
Emp. Form.C24H20N8O
Mol. Mass.436.4686
SMILESCn1cc(cn1)-c1ccc(=O)n(Cc2cccc(Nc3ncc(cn3)-c3cccnc3)c2)n1