Reaction Details
TargetCarbonic anhydrase 2
LigandBDBM50143810
Substrate/Competitorn/a
Meas. Tech.ChEMBL_1551184 (CHEMBL3761632)
Ki 2.2±n/a nM
Citation Yaseen, REkinci, DSenturk, MHameed, ADOvais, SRathore, PSamim, MJaved, KSupuran, CT Pyridazinone substituted benzenesulfonamides as potent carbonic anhydrase inhibitors. Bioorg Med Chem Lett26:1337-41 (2016) 
 
Carbonic anhydrase 2
Name:Carbonic anhydrase 2
Type:Enzyme
Mol. Mass.:29250.71
Organism:Homo sapiens (Human)
Description:P00918
Residue:260
BDBM50143810
NameBDBM50143810
Synonyms:CHEMBL3758504
TypeSmall organic molecule
Emp. Form.C19H17N3O3S
Mol. Mass.367.422
SMILESNS(=O)(=O)c1ccc(cc1)-n1nc(ccc1=O)-c1ccc2CCCc2c1