Reaction Details
TargetCarbonic anhydrase 1
LigandBDBM50143816
Substrate/Competitorn/a
Meas. Tech.ChEMBL_1551183 (CHEMBL3761631)
Ki 5.5±n/a nM
Citation Yaseen, REkinci, DSenturk, MHameed, ADOvais, SRathore, PSamim, MJaved, KSupuran, CT Pyridazinone substituted benzenesulfonamides as potent carbonic anhydrase inhibitors. Bioorg Med Chem Lett26:1337-41 (2016) 
 
Carbonic anhydrase 1
Name:Carbonic anhydrase 1
Type:Enzyme
Mol. Mass.:28873.37
Organism:Homo sapiens (Human)
Description:P00915
Residue:261
BDBM50143816
NameBDBM50143816
Synonyms:CHEMBL3758388
TypeSmall organic molecule
Emp. Form.C16H12BrN3O3S
Mol. Mass.406.254
SMILESNS(=O)(=O)c1ccc(cc1)-n1nc(ccc1=O)-c1ccc(Br)cc1