Reaction Details
TargetHistone deacetylase 1
LigandBDBM50143892
Substrate/Competitorn/a
Meas. Tech.ChEMBL_1551210 (CHEMBL3761791)
IC50 0.600000±n/a nM
Citation Ghosh, BZhao, WNReis, SAPatnaik, DFass, DMTsai, LHMazitschek, RHaggarty, SJ Dissecting structure-activity-relationships of crebinostat: Brain penetrant HDAC inhibitors for neuroepigenetic regulation. Bioorg Med Chem Lett26:1265-71 (2016) 
 
Histone deacetylase 1
Name:Histone deacetylase 1
Type:Enzyme
Mol. Mass.:55090.27
Organism:Homo sapiens (Human)
Description:Q13547
Residue:482
BDBM50143892
NameBDBM50143892
Synonyms:CHEMBL3759059
TypeSmall organic molecule
Emp. Form.C15H20BrN3O4
Mol. Mass.386.241
SMILESCOc1ccc(Br)c(\C=N\NC(=O)CCCCCC(=O)NO)c1