Reaction Details
TargetHistone deacetylase 2
LigandBDBM50143884
Substrate/Competitorn/a
Meas. Tech.ChEMBL_1551211 (CHEMBL3761792)
IC50 2.1±n/a nM
Citation Ghosh, BZhao, WNReis, SAPatnaik, DFass, DMTsai, LHMazitschek, RHaggarty, SJ Dissecting structure-activity-relationships of crebinostat: Brain penetrant HDAC inhibitors for neuroepigenetic regulation. Bioorg Med Chem Lett26:1265-71 (2016) 
 
Histone deacetylase 2
Name:Histone deacetylase 2
Type:Chromatin regulator; hydrolase; repressor
Mol. Mass.:55356.54
Organism:Homo sapiens (Human)
Description:Q92769
Residue:488
BDBM50143884
NameBDBM50143884
Synonyms:CHEMBL3759982
TypeSmall organic molecule
Emp. Form.C20H23N3O3
Mol. Mass.353.4149
SMILESONC(=O)CCCCCC(=O)N\N=C\c1ccc(cc1)-c1ccccc1