Reaction Details
TargetHistone deacetylase 2
LigandBDBM50143885
Substrate/Competitorn/a
Meas. Tech.ChEMBL_1551211 (CHEMBL3761792)
IC50 19±n/a nM
Citation Ghosh, BZhao, WNReis, SAPatnaik, DFass, DMTsai, LHMazitschek, RHaggarty, SJ Dissecting structure-activity-relationships of crebinostat: Brain penetrant HDAC inhibitors for neuroepigenetic regulation. Bioorg Med Chem Lett26:1265-71 (2016) 
 
Histone deacetylase 2
Name:Histone deacetylase 2
Type:Chromatin regulator; hydrolase; repressor
Mol. Mass.:55356.54
Organism:Homo sapiens (Human)
Description:Q92769
Residue:488
BDBM50143885
NameBDBM50143885
Synonyms:CHEMBL3758191
TypeSmall organic molecule
Emp. Form.C21H25N3O3
Mol. Mass.367.4415
SMILESCc1ccccc1-c1ccc(\C=N\NC(=O)CCCCCC(=O)NO)cc1