Reaction Details
TargetHistone deacetylase 3
LigandBDBM50143886
Substrate/Competitorn/a
Meas. Tech.ChEMBL_1551212 (CHEMBL3761793)
IC50 1.4±n/a nM
Citation Ghosh, BZhao, WNReis, SAPatnaik, DFass, DMTsai, LHMazitschek, RHaggarty, SJ Dissecting structure-activity-relationships of crebinostat: Brain penetrant HDAC inhibitors for neuroepigenetic regulation. Bioorg Med Chem Lett26:1265-71 (2016) 
 
Histone deacetylase 3
Name:Histone deacetylase 3
Type:Enzyme
Mol. Mass.:48829.55
Organism:Homo sapiens (Human)
Description:O15379
Residue:428
BDBM50143886
NameBDBM50143886
Synonyms:CHEMBL3758870
TypeSmall organic molecule
Emp. Form.C19H22N4O3
Mol. Mass.354.403
SMILESONC(=O)CCCCCC(=O)N\N=C\c1ccc(cc1)-c1ccccn1