Reaction Details
TargetHistone deacetylase 3
LigandBDBM50143892
Substrate/Competitorn/a
Meas. Tech.ChEMBL_1551212 (CHEMBL3761793)
IC50 1.2±n/a nM
Citation Ghosh, BZhao, WNReis, SAPatnaik, DFass, DMTsai, LHMazitschek, RHaggarty, SJ Dissecting structure-activity-relationships of crebinostat: Brain penetrant HDAC inhibitors for neuroepigenetic regulation. Bioorg Med Chem Lett26:1265-71 (2016) 
 
Histone deacetylase 3
Name:Histone deacetylase 3
Type:Enzyme
Mol. Mass.:48829.55
Organism:Homo sapiens (Human)
Description:O15379
Residue:428
BDBM50143892
NameBDBM50143892
Synonyms:CHEMBL3759059
TypeSmall organic molecule
Emp. Form.C15H20BrN3O4
Mol. Mass.386.241
SMILESCOc1ccc(Br)c(\C=N\NC(=O)CCCCCC(=O)NO)c1