Reaction Details
TargetHistone deacetylase 3
LigandBDBM50143893
Substrate/Competitorn/a
Meas. Tech.ChEMBL_1551212 (CHEMBL3761793)
IC50 26±n/a nM
Citation Ghosh, BZhao, WNReis, SAPatnaik, DFass, DMTsai, LHMazitschek, RHaggarty, SJ Dissecting structure-activity-relationships of crebinostat: Brain penetrant HDAC inhibitors for neuroepigenetic regulation. Bioorg Med Chem Lett26:1265-71 (2016) 
 
Histone deacetylase 3
Name:Histone deacetylase 3
Type:Enzyme
Mol. Mass.:48829.55
Organism:Homo sapiens (Human)
Description:O15379
Residue:428
BDBM50143893
NameBDBM50143893
Synonyms:CHEMBL3758246
TypeSmall organic molecule
Emp. Form.C16H23N3O6
Mol. Mass.353.3703
SMILESCOc1cc(O)cc(OC)c1\C=N\NC(=O)CCCCCC(=O)NO