Reaction Details
TargetCarbonic anhydrase 2
LigandBDBM50050775
Substrate/Competitorn/a
Meas. Tech.ChEMBL_1551381 (CHEMBL3762502)
Ki>20000±n/a nM
Citation Carradori, SSecci, DDe Monte, CMollica, ACeruso, MAkdemir, ASobolev, APCodispoti, RDe Cosmi, FGuglielmi, PSupuran, CT A novel library of saccharin and acesulfame derivatives as potent and selective inhibitors of carbonic anhydrase IX and XII isoforms. Bioorg Med Chem24:1095-105 (2016) 
 
Carbonic anhydrase 2
Name:Carbonic anhydrase 2
Type:Enzyme
Mol. Mass.:29250.71
Organism:Homo sapiens (Human)
Description:P00918
Residue:260
BDBM50050775
NameBDBM50050775
Synonyms:Acesulfame Potassium | E950
TypeSmall organic molecule
Emp. Form.C4H4KNO4S
Mol. Mass.201.242
SMILES[K+].CC1=CC(=O)[N-]S(=O)(=O)O1