Reaction Details
TargetCarbonic anhydrase 9
LigandBDBM50143907
Substrate/Competitorn/a
Meas. Tech.ChEMBL_1551382 (CHEMBL3762503)
Ki 19±n/a nM
Citation Carradori, SSecci, DDe Monte, CMollica, ACeruso, MAkdemir, ASobolev, APCodispoti, RDe Cosmi, FGuglielmi, PSupuran, CT A novel library of saccharin and acesulfame derivatives as potent and selective inhibitors of carbonic anhydrase IX and XII isoforms. Bioorg Med Chem24:1095-105 (2016) 
 
Carbonic anhydrase 9
Name:Carbonic anhydrase 9
Type:Enzyme
Mol. Mass.:49669.03
Organism:Homo sapiens (Human)
Description:Catalytic domain of human cloned isozyme was used in the assay
Residue:459
BDBM50143907
NameBDBM50143907
Synonyms:CHEMBL3759629
TypeSmall organic molecule
Emp. Form.C15H10F3NO3S
Mol. Mass.341.305
SMILESFC(F)(F)c1cccc(CN2C(=O)c3ccccc3S2(=O)=O)c1