Reaction Details
TargetCarbonic anhydrase 9
LigandBDBM50143991
Substrate/Competitorn/a
Meas. Tech.ChEMBL_1551382 (CHEMBL3762503)
Ki 26±n/a nM
Citation Carradori, SSecci, DDe Monte, CMollica, ACeruso, MAkdemir, ASobolev, APCodispoti, RDe Cosmi, FGuglielmi, PSupuran, CT A novel library of saccharin and acesulfame derivatives as potent and selective inhibitors of carbonic anhydrase IX and XII isoforms. Bioorg Med Chem24:1095-105 (2016) 
 
Carbonic anhydrase 9
Name:Carbonic anhydrase 9
Type:Enzyme
Mol. Mass.:49669.03
Organism:Homo sapiens (Human)
Description:Catalytic domain of human cloned isozyme was used in the assay
Residue:459
BDBM50143991
NameBDBM50143991
Synonyms:CHEMBL3758428
TypeSmall organic molecule
Emp. Form.C18H15NO5S
Mol. Mass.357.38
SMILESCC1=CC(=O)N(CC(=O)c2ccc(cc2)-c2ccccc2)S(=O)(=O)O1