Reaction Details
TargetCarbonic anhydrase 9
LigandBDBM50143993
Substrate/Competitorn/a
Meas. Tech.ChEMBL_1551382 (CHEMBL3762503)
Ki 18±n/a nM
Citation Carradori, SSecci, DDe Monte, CMollica, ACeruso, MAkdemir, ASobolev, APCodispoti, RDe Cosmi, FGuglielmi, PSupuran, CT A novel library of saccharin and acesulfame derivatives as potent and selective inhibitors of carbonic anhydrase IX and XII isoforms. Bioorg Med Chem24:1095-105 (2016) 
 
Carbonic anhydrase 9
Name:Carbonic anhydrase 9
Type:Enzyme
Mol. Mass.:49669.03
Organism:Homo sapiens (Human)
Description:Catalytic domain of human cloned isozyme was used in the assay
Residue:459
BDBM50143993
NameBDBM50143993
Synonyms:CHEMBL3758979
TypeSmall organic molecule
Emp. Form.C13H8N2O5S2
Mol. Mass.336.343
SMILES[O-][N+](=O)c1ccccc1SN1C(=O)c2ccccc2S1(=O)=O