Reaction Details
TargetCarbonic anhydrase 9
LigandBDBM50050775
Substrate/Competitorn/a
Meas. Tech.ChEMBL_1551382 (CHEMBL3762503)
Ki 2410±n/a nM
Citation Carradori, SSecci, DDe Monte, CMollica, ACeruso, MAkdemir, ASobolev, APCodispoti, RDe Cosmi, FGuglielmi, PSupuran, CT A novel library of saccharin and acesulfame derivatives as potent and selective inhibitors of carbonic anhydrase IX and XII isoforms. Bioorg Med Chem24:1095-105 (2016) 
 
Carbonic anhydrase 9
Name:Carbonic anhydrase 9
Type:Enzyme
Mol. Mass.:49669.03
Organism:Homo sapiens (Human)
Description:Catalytic domain of human cloned isozyme was used in the assay
Residue:459
BDBM50050775
NameBDBM50050775
Synonyms:Acesulfame Potassium | E950
TypeSmall organic molecule
Emp. Form.C4H4KNO4S
Mol. Mass.201.242
SMILES[K+].CC1=CC(=O)[N-]S(=O)(=O)O1