Reaction Details
TargetCarbonic anhydrase 1
LigandBDBM50143987
Substrate/Competitorn/a
Meas. Tech.ChEMBL_1551380 (CHEMBL3762501)
Ki>10000±n/a nM
Citation Carradori, SSecci, DDe Monte, CMollica, ACeruso, MAkdemir, ASobolev, APCodispoti, RDe Cosmi, FGuglielmi, PSupuran, CT A novel library of saccharin and acesulfame derivatives as potent and selective inhibitors of carbonic anhydrase IX and XII isoforms. Bioorg Med Chem24:1095-105 (2016) 
 
Carbonic anhydrase 1
Name:Carbonic anhydrase 1
Type:Enzyme
Mol. Mass.:28873.37
Organism:Homo sapiens (Human)
Description:P00915
Residue:261
BDBM50143987
NameBDBM50143987
Synonyms:CHEMBL3760047
TypeSmall organic molecule
Emp. Form.C13H13NO6S
Mol. Mass.311.31
SMILESCOc1cccc(c1)C(=O)CN1C(=O)C=C(C)OS1(=O)=O