Reaction Details
TargetCarbonic anhydrase 2
LigandBDBM50143986
Substrate/Competitorn/a
Meas. Tech.ChEMBL_1551381 (CHEMBL3762502)
Ki>10000±n/a nM
Citation Carradori, SSecci, DDe Monte, CMollica, ACeruso, MAkdemir, ASobolev, APCodispoti, RDe Cosmi, FGuglielmi, PSupuran, CT A novel library of saccharin and acesulfame derivatives as potent and selective inhibitors of carbonic anhydrase IX and XII isoforms. Bioorg Med Chem24:1095-105 (2016) 
 
Carbonic anhydrase 2
Name:Carbonic anhydrase 2
Type:Enzyme
Mol. Mass.:29250.71
Organism:Homo sapiens (Human)
Description:P00918
Residue:260
BDBM50143986
NameBDBM50143986
Synonyms:CHEMBL3758420
TypeSmall organic molecule
Emp. Form.C11H10N2O6S
Mol. Mass.298.272
SMILESCC1=CC(=O)N(Cc2ccc(cc2)[N+]([O-])=O)S(=O)(=O)O1