Reaction Details
TargetCarbonic anhydrase 2
LigandBDBM50143983
Substrate/Competitorn/a
Meas. Tech.ChEMBL_1551381 (CHEMBL3762502)
Ki>10000±n/a nM
Citation Carradori, SSecci, DDe Monte, CMollica, ACeruso, MAkdemir, ASobolev, APCodispoti, RDe Cosmi, FGuglielmi, PSupuran, CT A novel library of saccharin and acesulfame derivatives as potent and selective inhibitors of carbonic anhydrase IX and XII isoforms. Bioorg Med Chem24:1095-105 (2016) 
 
Carbonic anhydrase 2
Name:Carbonic anhydrase 2
Type:Enzyme
Mol. Mass.:29250.71
Organism:Homo sapiens (Human)
Description:P00918
Residue:260
BDBM50143983
NameBDBM50143983
Synonyms:CHEMBL1391313
TypeSmall organic molecule
Emp. Form.C15H10FNO4S
Mol. Mass.319.308
SMILESFc1ccc(cc1)C(=O)CN1C(=O)c2ccccc2S1(=O)=O