Reaction Details
TargetCarbonic anhydrase 2
LigandBDBM50334352
Substrate/Competitorn/a
Meas. Tech.ChEMBL_1551385 (CHEMBL3762506)
Ki 226±n/a nM
Citation Lomelino, CLMahon, BPMcKenna, RCarta, FSupuran, CT Kinetic and X-ray crystallographic investigations on carbonic anhydrase isoforms I, II, IX and XII of a thioureido analog of SLC-0111. Bioorg Med Chem24:976-81 (2016) 
 
Carbonic anhydrase 2
Name:Carbonic anhydrase 2
Type:Enzyme
Mol. Mass.:29250.71
Organism:Homo sapiens (Human)
Description:P00918
Residue:260
BDBM50334352
NameBDBM50334352
Synonyms:4-(3-cyclopentylureido)benzenesulfonamide CHEMBL1615215
TypeSmall organic molecule
Emp. Form.C12H17N3O3S
Mol. Mass.283.347
SMILESNS(=O)(=O)c1ccc(NC(=O)NC2CCCC2)cc1