Reaction Details
TargetMelatonin receptor type 1A
LigandBDBM50144221
Substrate/Competitorn/a
Meas. Tech.ChEMBL_1551497 (CHEMBL3762918)
EC50 4.6±n/a nM
Citation Landagaray, EEttaoussi, MDuroux, RBoutin, JACaignard, DHDelagrange, PMelnyk, PBerthelot, PYous, S Melatonergic ligands: Design, synthesis and pharmacological evaluation of novel series of naphthofuranic derivatives. Eur J Med Chem109:360-70 (2016) 
 
Melatonin receptor type 1A
Name:Melatonin receptor type 1A
Type:Enzyme
Mol. Mass.:39392.94
Organism:Homo sapiens (Human)
Description:P48039
Residue:350
BDBM50144221
NameBDBM50144221
Synonyms:CHEMBL3759802
TypeSmall organic molecule
Emp. Form.C17H17NO3
Mol. Mass.283.3218
SMILESCOc1ccc2ccc3occ(CCNC(C)=O)c3c2c1