Reaction Details
TargetPalmitoleoyl-protein carboxylesterase NOTUM
LigandBDBM50144549
Substrate/Competitorn/a
Meas. Tech.ChEMBL_1551504 (CHEMBL3762925)
EC50 20±n/a nM
Citation Han, QPabba, PKBarbosa, JMabon, RHealy, JPGardyan, MWTerranova, KMBrommage, RThompson, AYSchmidt, JMWilson, AGXu, XTarver, JECarson, KG 4H-Thieno[3,2-c]chromene based inhibitors of Notum Pectinacetylesterase. Bioorg Med Chem Lett26:1184-7 (2016) 
 
Palmitoleoyl-protein carboxylesterase NOTUM
Name:Palmitoleoyl-protein carboxylesterase NOTUM
Type:PROTEIN
Mol. Mass.:55706.36
Organism:Homo sapiens (Human)
Description:ChEMBL_116492
Residue:496
BDBM50144549
NameBDBM50144549
Synonyms:CHEMBL3758291
TypeSmall organic molecule
Emp. Form.C12H5F3O2S2
Mol. Mass.302.292
SMILESOC(=O)c1cc2CSc3c(F)c(F)c(F)cc3-c2s1