Reaction Details
TargetPalmitoleoyl-protein carboxylesterase NOTUM
LigandBDBM50144581
Substrate/Competitorn/a
Meas. Tech.ChEMBL_1551504 (CHEMBL3762925)
EC50 72±n/a nM
Citation Han, QPabba, PKBarbosa, JMabon, RHealy, JPGardyan, MWTerranova, KMBrommage, RThompson, AYSchmidt, JMWilson, AGXu, XTarver, JECarson, KG 4H-Thieno[3,2-c]chromene based inhibitors of Notum Pectinacetylesterase. Bioorg Med Chem Lett26:1184-7 (2016) 
 
Palmitoleoyl-protein carboxylesterase NOTUM
Name:Palmitoleoyl-protein carboxylesterase NOTUM
Type:PROTEIN
Mol. Mass.:55706.36
Organism:Homo sapiens (Human)
Description:ChEMBL_116492
Residue:496
BDBM50144581
NameBDBM50144581
Synonyms:CHEMBL3759700
TypeSmall organic molecule
Emp. Form.C13H8ClFO2S
Mol. Mass.282.718
SMILESOC(=O)c1cc2CCc3c(Cl)c(F)ccc3-c2s1