Reaction Details
TargetCannabinoid receptor 2
LigandBDBM50144611
Substrate/Competitorn/a
Meas. Tech.ChEMBL_1551637 (CHEMBL3760883)
Ki 6213±n/a nM
Citation Fulp, AZhang, YBortoff, KSeltzman, HSnyder, RWiethe, RAmato, GMaitra, R Pyrazole antagonists of the CB1 receptor with reduced brain penetration. Bioorg Med Chem24:1063-70 (2016) 
 
Cannabinoid receptor 2
Name:Cannabinoid receptor 2
Type:G Protein-Coupled Receptor (GPCR)
Mol. Mass.:39690.94
Organism:Homo sapiens (Human)
Description:P34972
Residue:360
BDBM50144611
NameBDBM50144611
Synonyms:CHEMBL3758491
TypeSmall organic molecule
Emp. Form.C26H29Cl3N4O3S
Mol. Mass.583.957
SMILESCC(C)CS(=O)(=O)N1CCC(CC1)NC(=O)c1nn(c(c1C)-c1ccc(Cl)cc1)-c1ccc(Cl)cc1Cl