Reaction Details
TargetCannabinoid receptor 2
LigandBDBM50144612
Substrate/Competitorn/a
Meas. Tech.ChEMBL_1551637 (CHEMBL3760883)
Ki 4719±n/a nM
Citation Fulp, AZhang, YBortoff, KSeltzman, HSnyder, RWiethe, RAmato, GMaitra, R Pyrazole antagonists of the CB1 receptor with reduced brain penetration. Bioorg Med Chem24:1063-70 (2016) 
 
Cannabinoid receptor 2
Name:Cannabinoid receptor 2
Type:G Protein-Coupled Receptor (GPCR)
Mol. Mass.:39690.94
Organism:Homo sapiens (Human)
Description:P34972
Residue:360
BDBM50144612
NameBDBM50144612
Synonyms:CHEMBL3759254
TypeSmall organic molecule
Emp. Form.C25H24Cl3F3N4O3S
Mol. Mass.623.902
SMILESCc1c(nn(c1-c1ccc(Cl)cc1)-c1ccc(Cl)cc1Cl)C(=O)NC1CCN(CC1)S(=O)(=O)CCC(F)(F)F