Reaction Details
TargetCannabinoid receptor 1
LigandBDBM50144613
Substrate/Competitorn/a
Meas. Tech.ChEMBL_1551636 (CHEMBL3760882)
Ki 44±n/a nM
Citation Fulp, AZhang, YBortoff, KSeltzman, HSnyder, RWiethe, RAmato, GMaitra, R Pyrazole antagonists of the CB1 receptor with reduced brain penetration. Bioorg Med Chem24:1063-70 (2016) 
 
Cannabinoid receptor 1
Name:Cannabinoid receptor 1
Type:G Protein-Coupled Receptor (GPCR)
Mol. Mass.:52868.96
Organism:Homo sapiens (Human)
Description:P21554
Residue:472
BDBM50144613
NameBDBM50144613
Synonyms:CHEMBL3758753
TypeSmall organic molecule
Emp. Form.C24H25Cl3N4O3S
Mol. Mass.555.904
SMILESCCS(=O)(=O)N1CCC(CC1)NC(=O)c1nn(c(c1C)-c1ccc(Cl)cc1)-c1ccc(Cl)cc1Cl