Reaction Details
TargetCannabinoid receptor 1
LigandBDBM50144614
Substrate/Competitorn/a
Meas. Tech.ChEMBL_1551636 (CHEMBL3760882)
Ki 7.5±n/a nM
Citation Fulp, AZhang, YBortoff, KSeltzman, HSnyder, RWiethe, RAmato, GMaitra, R Pyrazole antagonists of the CB1 receptor with reduced brain penetration. Bioorg Med Chem24:1063-70 (2016) 
 
Cannabinoid receptor 1
Name:Cannabinoid receptor 1
Type:G Protein-Coupled Receptor (GPCR)
Mol. Mass.:52868.96
Organism:Homo sapiens (Human)
Description:P21554
Residue:472
BDBM50144614
NameBDBM50144614
Synonyms:CHEMBL3758884
TypeSmall organic molecule
Emp. Form.C29H25Cl3N4O2
Mol. Mass.567.893
SMILESCc1c(nn(c1-c1ccc(Cl)cc1)-c1ccc(Cl)cc1Cl)C(=O)NC1CCN(CC1)C(=O)c1ccccc1