Reaction Details
TargetCannabinoid receptor 1
LigandBDBM50144609
Substrate/Competitorn/a
Meas. Tech.ChEMBL_1551636 (CHEMBL3760882)
Ki 8.8±n/a nM
Citation Fulp, AZhang, YBortoff, KSeltzman, HSnyder, RWiethe, RAmato, GMaitra, R Pyrazole antagonists of the CB1 receptor with reduced brain penetration. Bioorg Med Chem24:1063-70 (2016) 
 
Cannabinoid receptor 1
Name:Cannabinoid receptor 1
Type:G Protein-Coupled Receptor (GPCR)
Mol. Mass.:52868.96
Organism:Homo sapiens (Human)
Description:P21554
Residue:472
BDBM50144609
NameBDBM50144609
Synonyms:CHEMBL3759222
TypeSmall organic molecule
Emp. Form.C26H27Cl3N4O3
Mol. Mass.549.877
SMILESCCCOC(=O)N1CCC(CC1)NC(=O)c1nn(c(c1C)-c1ccc(Cl)cc1)-c1ccc(Cl)cc1Cl