Reaction Details
TargetCarbonic anhydrase 2
LigandBDBM10876
Substrate/Competitorn/a
Meas. Tech.ChEMBL_1552239 (CHEMBL3761241)
Ki 46±n/a nM
Citation Del Prete, SVullo, DDe Luca, VCarginale, VFerraroni, MOsman, SMAlOthman, ZSupuran, CTCapasso, C Sulfonamide inhibition studies of the฿-carbonic anhydrase from the pathogenic bacterium Vibrio cholerae. Bioorg Med Chem24:1115-20 (2016) 
 
Carbonic anhydrase 2
Name:Carbonic anhydrase 2
Type:Enzyme
Mol. Mass.:29250.71
Organism:Homo sapiens (Human)
Description:P00918
Residue:260
BDBM10876
NameBDBM10876
Synonyms:4-(hydroxymethyl)benzene-1-sulfonamide JMC522226 Compound 20 aromatic/heteroaromatic sulfonamide 21
TypeSmall organic molecule
Emp. Form.C7H9NO3S
Mol. Mass.187.216
SMILESNS(=O)(=O)c1ccc(CO)cc1