Reaction Details
TargetCarbonic anhydrase 2
LigandBDBM10873
Substrate/Competitorn/a
Meas. Tech.ChEMBL_1552239 (CHEMBL3761241)
Ki 30±n/a nM
Citation Del Prete, SVullo, DDe Luca, VCarginale, VFerraroni, MOsman, SMAlOthman, ZSupuran, CTCapasso, C Sulfonamide inhibition studies of the฿-carbonic anhydrase from the pathogenic bacterium Vibrio cholerae. Bioorg Med Chem24:1115-20 (2016) 
 
Carbonic anhydrase 2
Name:Carbonic anhydrase 2
Type:Enzyme
Mol. Mass.:29250.71
Organism:Homo sapiens (Human)
Description:P00918
Residue:260
BDBM10873
NameBDBM10873
Synonyms:4-[(2-aminopyrimidin-4-yl)amino]benzene-1-sulfonamide US9616064, Compound 1aa | aromatic/heteroaromatic sulfonamide 18
TypeSmall organic molecule
Emp. Form.C10H11N5O2S
Mol. Mass.265.292
SMILESNc1nccc(Nc2ccc(cc2)S(N)(=O)=O)n1