Reaction Details
TargetCarbonic anhydrase 2
LigandBDBM10872
Substrate/Competitorn/a
Meas. Tech.ChEMBL_1552239 (CHEMBL3761241)
Ki 125±n/a nM
Citation Del Prete, SVullo, DDe Luca, VCarginale, VFerraroni, MOsman, SMAlOthman, ZSupuran, CTCapasso, C Sulfonamide inhibition studies of the฿-carbonic anhydrase from the pathogenic bacterium Vibrio cholerae. Bioorg Med Chem24:1115-20 (2016) 
 
Carbonic anhydrase 2
Name:Carbonic anhydrase 2
Type:Enzyme
Mol. Mass.:29250.71
Organism:Homo sapiens (Human)
Description:P00918
Residue:260
BDBM10872
NameBDBM10872
Synonyms:4-amino-N-[2-(4-sulfamoylphenyl)ethyl]benzene-1-sulfonamide aromatic/heteroaromatic sulfonamide 17
TypeSmall organic molecule
Emp. Form.C14H17N3O4S2
Mol. Mass.355.432
SMILESNc1ccc(cc1)S(=O)(=O)NCCc1ccc(cc1)S(N)(=O)=O