Reaction Details
TargetCarbonic anhydrase 2
LigandBDBM26999
Substrate/Competitorn/a
Meas. Tech.ChEMBL_1552239 (CHEMBL3761241)
Ki 9.0±n/a nM
Citation Del Prete, SVullo, DDe Luca, VCarginale, VFerraroni, MOsman, SMAlOthman, ZSupuran, CTCapasso, C Sulfonamide inhibition studies of the฿-carbonic anhydrase from the pathogenic bacterium Vibrio cholerae. Bioorg Med Chem24:1115-20 (2016) 
 
Carbonic anhydrase 2
Name:Carbonic anhydrase 2
Type:Enzyme
Mol. Mass.:29250.71
Organism:Homo sapiens (Human)
Description:P00918
Residue:260
BDBM26999
NameBDBM26999
Synonyms:4-(1,1-dioxo-1,2-thiazinan-2-yl)benzene-1-sulfonamide Contravul Sulthiame (SLT) | Sulthiame, 2
TypeSmall organic molecule
Emp. Form.C10H14N2O4S2
Mol. Mass.290.359
SMILESNS(=O)(=O)c1ccc(cc1)N1CCCCS1(=O)=O