Reaction Details
TargetCarbonic anhydrase 1
LigandBDBM10871
Substrate/Competitorn/a
Meas. Tech.ChEMBL_1552240 (CHEMBL3761242)
Ki 23000±n/a nM
Citation Del Prete, SVullo, DDe Luca, VCarginale, VFerraroni, MOsman, SMAlOthman, ZSupuran, CTCapasso, C Sulfonamide inhibition studies of the฿-carbonic anhydrase from the pathogenic bacterium Vibrio cholerae. Bioorg Med Chem24:1115-20 (2016) 
 
Carbonic anhydrase 1
Name:Carbonic anhydrase 1
Type:Enzyme
Mol. Mass.:28873.37
Organism:Homo sapiens (Human)
Description:P00915
Residue:261
BDBM10871
NameBDBM10871
Synonyms:4-amino-N-[(4-sulfamoylphenyl)methyl]benzene-1-sulfonamide aromatic/heteroaromatic sulfonamide 16
TypeSmall organic molecule
Emp. Form.C13H15N3O4S2
Mol. Mass.341.406
SMILESNc1ccc(cc1)S(=O)(=O)NCc1ccc(cc1)S(N)(=O)=O