Reaction Details
TargetSerine-protein kinase ATM
LigandBDBM50144958
Substrate/Competitorn/a
Meas. Tech.ChEMBL_1556115 (CHEMBL3768359)
IC50 800±n/a nM
Citation Min, JGuo, KSuryadevara, PKZhu, FHolbrook, GChen, YFeau, CYoung, BMLemoff, AConnelly, MCKastan, MBGuy, RK Optimization of a Novel Series of Ataxia-Telangiectasia Mutated Kinase Inhibitors as Potential Radiosensitizing Agents. J Med Chem59:559-77 (2016) 
 
Serine-protein kinase ATM
Name:Serine-protein kinase ATM
Type:Protein
Mol. Mass.:350696.72
Organism:Homo sapiens (Human)
Description:Q13315
Residue:3056
BDBM50144958
NameBDBM50144958
Synonyms:CHEMBL3763939
TypeSmall organic molecule
Emp. Form.C23H26N8O4
Mol. Mass.478.5037
SMILESCOc1cc2ncnc(-n3nc(nc3N)-c3ccccn3)c2cc1OCCNC(=O)OC(C)(C)C